{"text_format":"1","workbook":"xlsx","n_sheets":10,"sheets":["Instructions","UpdatedForecast","ChangesInAssumptions","RevenueEnhancements","ExpenditureReductions","ProjectedForecast","Narrative","PrintMacros_hide","LookupData","District_Lookup"],"not_rendered":{"charts":0,"images":2,"macros":1,"external_links":0,"defined_names":40,"comments":5,"pivot_tables":0},"unopened":[],"bounds":{"document_bytes":16777216,"sheet_cells":100000,"rows_first":2000,"rows_last":500,"rows_between":2000,"halvings":0,"cell_chars":16384,"cell_head_chars":4096},"cells_cut":0,"cells_raw":0,"read":"whole","date_system":"1900"}

{"sheet":"Instructions","index":0,"n_rows":68,"n_cols":2,"rows_kept":68,"cut":false,"hidden":false,"merged":[[10,0,10,1],[11,0,11,1],[34,0,34,1],[9,0,9,1],[13,0,13,1],[28,0,28,1],[29,0,29,1],[27,0,27,1],[8,0,8,1],[0,0,0,1],[1,0,1,1],[3,0,3,1],[4,0,4,1],[7,0,7,1],[5,0,5,1],[6,0,6,1],[52,0,52,1],[66,0,66,1],[30,0,30,1],[31,0,31,1],[32,0,32,1],[33,0,33,1],[46,0,46,1],[49,0,49,1],[56,0,56,1]]}
[]
["Plan Instructions"]
[]
[]
["Background:  The Department of Education & Workforce examines five-year forecast submissions to determine whether a district has the potential to incur a deficit during the first three years of the five-year period. Ohio Law requires districts with potential deficits to have plans in place to resolve those deficits. This workbook is designed to capture the various components of a district's plan to ensure submitted plans are sufficiently itemized, quantified, and detailed; thereby, demonstrating the plan is sufficient to eliminate the projected deficit(s). The workbook consists of 7 worksheets (tabs) shown below. "]
[]
["Purpose: As discussed in the accompanying notification letter, this workbook is intended to document the district's \"Plan B\".  All plan items must be fully controllable and executable by the board of education to be acceptable. Any actions which the board does not fully control and have the authority to implement, or items that have not been fully approved by all required parties, are considered a district’s “PLAN A”. “Plan A” proposals may be discussed in the district's plan narrative; however, they should not be included in the plan. Examples include unapproved new levies, unapproved renewals, items which still require negotiation and contractual agreements that are not fully executed. "]
[]
["Support: Please contact the fiscal consultant assigned to your district for assistance in developing your plan and completing this workbook. Your fiscal consultant is the first level of review for approval or disapproval of the plan. "]
[]
{"$rows_left_out":59}
{"sheet":"UpdatedForecast","index":1,"n_rows":99,"n_cols":18,"rows_kept":99,"cut":false,"hidden":false,"merged":[[2,0,2,2],[4,1,5,5],[4,7,5,11],[4,13,5,17],[1,0,1,3],[4,0,5,0],[90,7,92,7],[90,8,92,8],[90,9,92,9],[90,10,92,10],[90,11,92,11]]}
[]
["(select district here)",null,null,null,null,null,null,null,null,"UPDATED FORECAST (BEFORE PLAN)",null,null,null,null,null,"Board Approval Date:",null,{"$f":"ProjectedForecast!AD1","v":"00:00:00"}]
["PRECAUTION WRITTEN PLAN"]
[]
["FY2024 Fall Forecast Submission","Current Forecast",null,null,null,null,null,"Changes in Assumptions",null,null,null,null,null,"Updated Forecast (Before Plan)"]
[null,null,null,null,null,null,null,"District's Proposed Plan"]
[]
["Forecast Line",{"$f":"LEFT(UpdatedForecast!A5,6)","v":"FY2024"},{"$f":"\"FY\"&RIGHT(B8,4)+1","v":"FY2025"},{"$f":"\"FY\"&RIGHT(C8,4)+1","v":"FY2026"},{"$f":"\"FY\"&RIGHT(D8,4)+1","v":"FY2027"},"FY2028",null,{"$f":"B8","v":"FY2024"},{"$f":"C8","v":"FY2025"},{"$f":"D8","v":"FY2026"},{"$f":"E8","v":"FY2027"},"FY2028",null,{"$f":"B8","v":"FY2024"},{"$f":"C8","v":"FY2025"},{"$f":"D8","v":"FY2026"},{"$f":"E8","v":"FY2027"},"FY2028"]
["01.010 General Property Tax (Real Estate)",null,null,null,null,null,null,{"$f":"ChangesInAssumptions!$T62","v":0},{"$f":"ChangesInAssumptions!$AG62","v":0},{"$f":"ChangesInAssumptions!$AT62","v":0},{"$f":"ChangesInAssumptions!$BG62","v":0},{"$f":"ChangesInAssumptions!$BT62","v":0},null,{"$f":"B9+H9","v":0},0,0,0,0]
["01.020 Tangible Personal Property Tax",null,null,null,null,null,null,{"$f":"ChangesInAssumptions!$T63","v":0},{"$f":"ChangesInAssumptions!$AG63","v":0},{"$f":"ChangesInAssumptions!$AT63","v":0},{"$f":"ChangesInAssumptions!$BG63","v":0},{"$f":"ChangesInAssumptions!$BT63","v":0},null,0,0,0,0,0]
{"$rows_left_out":90}
{"sheet":"ChangesInAssumptions","index":2,"n_rows":126,"n_cols":72,"rows_kept":126,"cut":false,"hidden":false,"merged":[[12,2,12,3],[11,33,11,45],[11,0,11,1],[9,70,9,71],[9,0,9,2],[11,7,11,19],[11,20,11,32],[10,0,10,1],[11,46,11,58],[11,59,11,71]]}
[]
[null,null,null,null,null,null,null,null,null,null,null,null,null,null,null,null,null,null,null,null,null,null,null,null,null,null,null,null,null,null,null,null,null,null,null,null,null,null,null,null,null,null,null,null,null,null,null,null,null,null,null,null,null,null,null,null,null,null,null,null,null,null,null,null,null,null,null,null,null,null,"Revision:","FY22-002"]
[]
[]
[]
[]
[]
[]
[]
[{"$f":"IF(UpdatedForecast!A2=\"(Select District Here)\",\"\",UpdatedForecast!A2)","v":""},null,null,null,null,null,null,null,null,null,null,null,null,null,null,null,null,null,null,null,null,null,null,null,null,null,null,null,null,null,null,null,null,null,null,null,null,null,null,null,null,null,null,null,null,null,null,null,null,null,null,null,null,null,null,null,null,null,null,null,null,null,null,null,null,null,null,"                Board Approval Date:",null,null,{"$f":"ProjectedForecast!AD1","v":"00:00:00"}]
{"$rows_left_out":117}
{"sheet":"RevenueEnhancements","index":3,"n_rows":106,"n_cols":72,"rows_kept":106,"cut":false,"hidden":false,"merged":[[9,70,9,71],[12,3,12,4],[9,0,9,3],[11,0,11,2],[11,46,11,58],[11,59,11,71],[11,33,11,45],[11,7,11,19],[11,20,11,32]]}
[]
[null,null,null,null,null,null,null,null,null,null,null,null,null,null,null,null,null,null,null,null,null,null,null,null,null,null,null,null,null,null,null,null,null,null,null,null,null,null,null,null,null,null,null,null,null,null,null,null,null,null,null,null,null,null,null,null,null,null,null,null,null,null,null,null,null,null,null,null,null,null,"Revision:","FY22-002"]
[]
[]
[]
[]
[]
[]
[]
[{"$f":"IF(UpdatedForecast!A2=\"(Select District Here)\",\"\",UpdatedForecast!A2)","v":""},null,null,null,null,null,null,null,null,null,null,null,null,null,null,null,null,null,null,null,null,null,null,null,null,null,null,null,null,null,null,null,null,null,null,null,null,null,null,null,null,null,null,null,null,null,null,null,null,null,null,null,null,null,null,null,null,null,null,null,null,null,null,null,null,null,null,"                Board Approval Date:",null,null,{"$f":"ProjectedForecast!AD1","v":"00:00:00"}]
{"$rows_left_out":97}
{"sheet":"ExpenditureReductions","index":4,"n_rows":269,"n_cols":72,"rows_kept":269,"cut":false,"hidden":false,"merged":[[12,3,12,4],[11,46,11,58],[9,70,9,71],[11,0,11,2],[9,0,9,3],[11,7,11,19],[11,20,11,32],[11,33,11,45],[11,59,11,71]]}
[]
[null,null,null,null,null,null,null,null,null,null,null,null,null,null,null,null,null,null,null,null,null,null,null,null,null,null,null,null,null,null,null,null,null,null,null,null,null,null,null,null,null,null,null,null,null,null,null,null,null,null,null,null,null,null,null,null,null,null,null,null,null,null,null,null,null,null,null,null,null,null,"Revision:","FY22-002"]
[]
[]
[]
[]
[]
[]
[]
[{"$f":"IF(UpdatedForecast!A2=\"(Select District Here)\",\"\",UpdatedForecast!A2)","v":""},null,null,null,null,null,null,null,null,null,null,null,null,null,null,null,null,null,null,null,null,null,null,null,null,null,null,null,null,null,null,null,null,null,null,null,null,null,null,null,null,null,null,null,null,null,null,null,null,null,null,null,null,null,null,null,null,null,null,null,null,null,null,null,null,null,null,"                Board Approval Date:",null,null,{"$f":"ProjectedForecast!AD1","v":"00:00:00"}]
{"$rows_left_out":260}
{"sheet":"ProjectedForecast","index":5,"n_rows":103,"n_cols":30,"rows_kept":103,"cut":false,"hidden":false,"merged":[[4,0,5,0],[102,25,102,27],[4,7,5,11],[4,13,5,17],[101,7,101,10],[4,1,5,5],[4,19,5,23],[4,25,5,29],[96,25,96,26],[96,27,96,29],[101,0,101,1],[101,2,101,4],[101,19,101,22],[101,25,101,27],[102,7,102,10],[101,13,101,16],[90,23,92,23],[102,13,102,16],[102,2,102,4],[102,19,102,22],[90,19,92,19],[90,20,92,20],[90,21,92,21],[90,22,92,22]]}
[{"$f":"IF(UpdatedForecast!A2=\"(select district here)\",\"\",UpdatedForecast!A2)","v":""},null,null,null,null,null,null,"HIDE",null,null,null,null,null,null,null,null,null,null,null,null,null,"PROJECTED FORECAST (AFTER PLAN)",null,null,null,null,null,"Board Approval Date:"]
[]
[{"$f":"UpdatedForecast!A3&\" WORKBOOK\"","v":"PRECAUTION WRITTEN PLAN WORKBOOK"}]
[]
[{"$f":"UpdatedForecast!A5","v":"FY2024 Fall Forecast Submission"},"Updated Forecast\n(After Changes in Assumptions)",null,null,null,null,null,"Revenue Enhancements",null,null,null,null,null,"Expenditure Reductions",null,null,null,null,null,"Plan Impact\n(Expenditure Reductions and Revenue Enhancements)",null,null,null,null,null,"Projected Forecast\n(Reflecting Plan Implementation)"]
[null,null,null,null,null,null,null,null,null,null,null,null,null,null,null,null,null,null,null,"District's Proposed Plan"]
[]
["Forecast Line",{"$f":"LEFT(UpdatedForecast!A5,6)","v":"FY2024"},{"$f":"\"FY\"&RIGHT(B8,4)+1","v":"FY2025"},{"$f":"\"FY\"&RIGHT(C8,4)+1","v":"FY2026"},"FY2027","FY2028",null,{"$f":"B8","v":"FY2024"},{"$f":"C8","v":"FY2025"},"FY2026","FY2027","FY2028",null,{"$f":"B8","v":"FY2024"},{"$f":"C8","v":"FY2025"},"FY2026",{"$f":"E8","v":"FY2027"},"FY2028",null,{"$f":"B8","v":"FY2024"},{"$f":"C8","v":"FY2025"},{"$f":"D8","v":"FY2026"},{"$f":"E8","v":"FY2027"},{"$f":"F8","v":"FY2028"},null,{"$f":"B8","v":"FY2024"},{"$f":"C8","v":"FY2025"},{"$f":"D8","v":"FY2026"},{"$f":"E8","v":"FY2027"},{"$f":"F8","v":"FY2028"}]
["01.010 General Property Tax (Real Estate)",{"$f":"UpdatedForecast!N9","v":0},{"$f":"UpdatedForecast!O9","v":0},{"$f":"UpdatedForecast!P9","v":0},{"$f":"UpdatedForecast!Q9","v":0},{"$f":"UpdatedForecast!R9","v":0},null,{"$f":"RevenueEnhancements!$T41","v":0},{"$f":"RevenueEnhancements!$AG41","v":0},{"$f":"RevenueEnhancements!$AT41","v":0},{"$f":"RevenueEnhancements!$BG41","v":0},{"$f":"RevenueEnhancements!$BT41","v":0},null,{"$f":"ExpenditureReductions!$T205","v":0},{"$f":"ExpenditureReductions!$AG205","v":0},{"$f":"ExpenditureReductions!$AT205","v":0},{"$f":"ExpenditureReductions!$BG205","v":0},{"$f":"ExpenditureReductions!$BT205","v":0},null,{"$f":"H9+N9","v":0},{"$f":"I9+O9","v":0},0,0,0,null,{"$f":"B9+T9","v":0},0,0,0,0]
["01.020 Tangible Personal Property Tax",{"$f":"UpdatedForecast!N10","v":0},{"$f":"UpdatedForecast!O10","v":0},{"$f":"UpdatedForecast!P10","v":0},{"$f":"UpdatedForecast!Q10","v":0},{"$f":"UpdatedForecast!R10","v":0},null,{"$f":"RevenueEnhancements!$T42","v":0},{"$f":"RevenueEnhancements!$AG42","v":0},{"$f":"RevenueEnhancements!$AT42","v":0},{"$f":"RevenueEnhancements!$BG42","v":0},{"$f":"RevenueEnhancements!$BT42","v":0},null,{"$f":"ExpenditureReductions!$T206","v":0},{"$f":"ExpenditureReductions!$AG206","v":0},{"$f":"ExpenditureReductions!$AT206","v":0},{"$f":"ExpenditureReductions!$BG206","v":0},{"$f":"ExpenditureReductions!$BT206","v":0},null,{"$f":"H10+N10","v":0},{"$f":"I10+O10","v":0},{"$f":"J10+P10","v":0},{"$f":"K10+Q10","v":0},{"$f":"L10+R10","v":0},null,0,0,0,0,0]
{"$rows_left_out":94}
{"sheet":"Narrative","index":6,"n_rows":7,"n_cols":1,"rows_kept":7,"cut":false,"hidden":false,"merged":[]}
["Plan Narrative Requirements"]
[]
["The accompanying narrative should be used to fully communicate the district's plan objectives and include the following categories: \n\n   Introduction - Factually discuss any historical actions taken to address projected deficits and any \"Plan A\" items that may affect the plan. \n   Changes in Assumptions - recap important information and details concerning any changes in assumptions by fiscal year of impact. \n   Revenue Enhancements - recap the assumptions used to determine the amount and timing of the enhancements, by fiscal year. \n   Expenditure Reductions - recap the assumptions used to determine the amount and timing of the reductions, by fiscal year.\n   Plan Management  - explain how the board of education will monitor plan implementation including the financial reports to be used.\n\nAll submissions must include a treasurer certified copy of the board resolution which indicates the date the full plan narrative and workbook were provided, reviewed and approved by the board of education. Alternatively, the final page of the narrative can specify the date the board of education approved all pages of the narrative and written plan and both the written plan document and the narrative must be signed by the board president, superintendent, and treasurer. "]
[]
["Support: Please contact the fiscal consultant assigned to your district for assistance in developing the plan narrative. Your fiscal consultant is the first level of review for approval or disapproval of the plan. "]
[]
["Workbook Rev. 2023.11.28"]

{"sheet":"PrintMacros_hide","index":7,"n_rows":43,"n_cols":18,"rows_kept":43,"cut":false,"hidden":true,"merged":[]}
[null,null,null,null,null,null,null,null,null,"Works"]
[null,null,null,null,null,null,null,null,null,"Sub print_all_new()",null,null,null,null,null,"Print Single Worksheet or Selection:"]
[null,null,null,null,null,null,null,null,null,"Dim PrintFile As String",null,null,null,null,null,"Public Sub print_all()"]
[null,null,null,null,null,null,null,null,null,"PrintFile = Application.DefaultFilePath & \"\\\" & _",null,null,null,null,null,"Dim PrintFile As String"]
[null,null,null,null,null,null,null,null,null,"ActiveWorkbook.Name & \".pdf\"",null,null,null,null,null,"PrintFile = Application.DefaultFilePath & \"\\\" & _"]
[null,null,null,null,null,null,null,null,null,"Sheets(Array(\"UpdatedForecast\", \"ChangesInAssumptions\")).Select",null,null,null,null,null,"ActiveWorkbook.Name & \".pdf\""]
[null,null,null,null,null,null,null,null,null,"ActiveSheet.PageSetup.PrintArea = \"A1:R98\"",null,null,null,null,null,"Sheets(\"UpdatedForecast\").Select"]
[null,null,null,null,null,null,null,null,null,"ActiveSheet.ExportAsFixedFormat Type:=xlTypePDF, _",null,null,null,null,null,"ActiveSheet.PageSetup.PrintArea = \"A1:R98\""]
[null,null,"HHHH",null,null,null,null,null,null,"Filename:=PrintFile, Quality:=xlQualityStandard, _",null,null,null,null,null,"ActiveSheet.ExportAsFixedFormat Type:=xlTypePDF, _"]
[null,null,null,null,null,null,null,null,null,"IncludeDocProperties:=True, IgnorePrintAreas:=False, _",null,null,null,null,null,"Filename:=PrintFile, Quality:=xlQualityStandard, _"]
{"$rows_left_out":34}
{"sheet":"LookupData","index":8,"n_rows":111,"n_cols":15,"rows_kept":111,"cut":false,"hidden":true,"merged":[]}
["Lookup Data/Notes",null,null,null,null,null,null,null,null,null,null,null,null,"1.045 Restricted Federal Grants-in-Aid - SFSF","Revenue"]
[null,null,null,null,null,"forecast_update_lookup2"]
["sub_lookup","expense_lookup","revenue_lookup","expense_verify_lookup","revenue_verify_lookup","forecast_update_lookup1","Type","levy_type","submission_month_lookup","monthname_lookup",null,"status_lookup","Fcast_Yrs"]
["FY2022 Fall Forecast Submission","03.010 Wages","01.010 General Property Tax (Real Estate)","No longer on pay report (to confirm payroll and benefits)","Passage of levy verified.","01.010 General Property Tax (Real Estate)","Revenue","Emergency","August",1,"July","PRECAUTION WRITTEN PLAN",{"$f":"RevenueEnhancements!H12","v":"FY2024"}]
["FY2022 Fall Optional Submission","03.020 Benefits","01.020 Tangible Personal Property Tax","Signed contract provided.","Fee schedule provided.","01.020 Tangible Personal Property Tax","Revenue","Other","January",2,"August","CAUTION FINANCIAL RECOVERY PLAN",{"$f":"RevenueEnhancements!U12","v":"FY2025"}]
["FY2022 Spring Forecast Submission","03.030 Purchased Services","01.030 Income Tax","Written cancellation request provided.","Receipt confirmed on system report.","01.030 Income Tax","Revenue",null,null,3,"September","WATCH FINANCIAL RECOVERY PLAN",{"$f":"RevenueEnhancements!AH12","v":"FY2026"}]
["FY2022 Spring Optional Submission","03.040 Supplies","01.035 Unrestricted State Grants-in-Aid","Board minutes (if only confirmation available)","Confirmation of advance received.","01.035 Unrestricted State Grants-in-Aid","Revenue",null,null,4,"October","EMERGENCY FINANCIAL RECOVERY PLAN",{"$f":"RevenueEnhancements!AU12","v":"FY2027"}]
["FY2023 Fall Forecast Submission","03.050 Capital Outlay","01.040 Restricted State Grants-in-Aid","Copy of bill or invoice showing lower cost provided.","Board minutes accepting donation received.","01.040 Restricted State Grants-in-Aid","Revenue",null,null,5,"November",null,{"$f":"RevenueEnhancements!BH12","v":"FY2028"}]
["FY2023 Fall Optional Submission","03.060 Intergovernmental","1.045 Restricted Federal Grants-in-Aid - SFSF","Usage or activity report showing decreased utilization.","Copy of tax anticpation note received.","01.050 State Share of Local Property Taxes","Revenue",null,null,6,"December"]
["FY2023 Spring Forecast Submission","04.010   Principal-All (Historical Only)","01.050 State Share of Local Property Taxes","Compare to previous year levels.",null,"01.060 All Other Revenues","Revenue",null,null,7,"January"]
{"$rows_left_out":102}
{"sheet":"District_Lookup","index":9,"n_rows":665,"n_cols":4,"rows_kept":665,"cut":false,"hidden":true,"merged":[]}
["District_Unique Lookup table:"]
[]
["District_Unique","IRN","Dist_Name","County"]
["(select district here)"]
["Ada Exempted Village (Hardin)","045187","Ada Exempted Village","Hardin"]
["Adams County Ohio Valley  (Adams)","061903","Adams County Ohio Valley ","Adams"]
["Adena Local (Ross)","049494","Adena Local","Ross"]
["Akron (Summit)","043489","Akron","Summit"]
["Alexander Local (Athens)","045906","Alexander Local","Athens"]
["Allen East Local (Allen)","045757","Allen East Local","Allen"]
{"$rows_left_out":655}