{"text_format":"1","workbook":"xlsx","n_sheets":7,"sheets":["VendorResponse","Key Areas Table","Requirements","Vendor Information Sheet","Print Version","ApprovalDetails","Dyslexia Short Form"],"not_rendered":{"charts":0,"images":0,"macros":1,"external_links":1,"defined_names":15,"comments":0,"pivot_tables":0},"unopened":[],"bounds":{"document_bytes":16777216,"sheet_cells":100000,"rows_first":2000,"rows_last":500,"rows_between":2000,"halvings":0,"cell_chars":16384,"cell_head_chars":4096},"cells_cut":0,"cells_raw":0,"read":"whole","date_system":"1900"}

{"sheet":"VendorResponse","index":0,"n_rows":99,"n_cols":22,"rows_kept":99,"cut":false,"hidden":false,"merged":[[9,9,9,12],[9,13,9,16],[9,6,9,8],[2,2,2,5],[3,2,3,5],[9,2,9,5]]}
["Vendor Submission Tool: Vendor Assessments for 2024-2025"]
["Vendors are to respond to all pertinent green boxes below. One tool is required for each discrete assessment. Please retain form as an active xlsm document and also submit as a pdf."]
[null,"Enter Vendor Name Here:"]
[null,"Enter Assessment Name/Description:"]
[null,null,"Application 1","Application 2","Application 3","Application 4"]
[null,"Select Up to 4 Purposes for your Assessment Submission: (Use a second workbook if more than four purposes are proposed for the same assessment.):","None","None","None","None"]
[null,"Grade Level or Age Range:"]
[null,"Content Area(s) or Subject Area(s) Alignment:"]
[null,"Application Sufficient:",{"$f":"IF(SUM(S12:S99)>0,\"Issue Reported\",\"No Issue Noted\")","v":"No Issue Noted"},{"$f":"IF(SUM(T12:T99)>0,\"Issue Reported\",\"No Issue Noted\")","v":"No Issue Noted"},{"$f":"IF(SUM(U12:U99)>0,\"Issue Reported\",\"No Issue Noted\")","v":"No Issue Noted"},{"$f":"IF(SUM(V12:V99)>0,\"Issue Reported\",\"No Issue Noted\")","v":"No Issue Noted"}]
[null,null,"Submission Requirements by Purpose",null,null,null,"Vendor Documentation",null,null,"1st ODE Evaluation",null,null,null,"2nd ODE Evaluation"]
["Element","Requirement",{"$f":"C6","v":"None"},{"$f":"D6","v":"None"},{"$f":"E6","v":"None"},{"$f":"F6","v":"None"},"Document File Name and Location or \"No Change\"","Page Number of Information or \"No Change\"","Additional Notes","First Score Adequate","Provided Documentation","Notes","Reader Names","Second Score Adequate?","Provided Documentation","Re-Read Notes","Re-Reader Names","Insufficient Indicator","Application 1","Application 2","Application 3","Application 4"]
[1,"VENDOR CAPABILITY: Readers will evaluate general capacity of vendor to meet assessment needs of Ohio districts."]
[1.1000000000000001,"The vendor describes sufficient services to reasonably support needs of LEAs (training and professional development as needed to administer assessment and interpret results, ongoing communication and support available during test administration).",{"$f":"IF(INDEX(Requirements,MATCH($A13,Elements,0),MATCH(C$11,Categories,0))=0,\"\",(INDEX(Requirements,MATCH($A13,Elements,0),MATCH(C$11,Categories,0))))","v":""},{"$f":"IF(INDEX(Requirements,MATCH($A13,Elements,0),MATCH(D$11,Categories,0))=0,\"\",(INDEX(Requirements,MATCH($A13,Elements,0),MATCH(D$11,Categories,0))))","v":""},"","",null,null,null,null,null,null,null,null,null,null,null,{"$f":"IF(N13=\"Y\",0,IF(J13=\"N\",1,0))","v":0},{"$f":"IF(C13=\"Required\",1*$R13,0)","v":0},{"$f":"IF(D13=\"Required\",1*$R13,0)","v":0},{"$f":"IF(E13=\"Required\",1*$R13,0)","v":0},{"$f":"IF(F13=\"Required\",1*$R13,0)","v":0}]
[1.2,"Organizational structure for service delivery (location, supervision, staff) is described adequately to allow LEAs to make informed decisions.","","","","",null,null,null,null,null,null,null,null,null,null,null,0,0,0,0,0]
[1.3,"The vendor describes a history of producing assessment instruments supported by three references for whom it has provided similar services in the past.","","","","",null,null,null,null,null,null,null,null,null,null,null,0,0,0,0,0]
[1.4,"Requirement Eliminated","","","","",null,null,null,null,null,null,null,null,null,null,null,0,0,0,0,0]
["1.5","Requirement Eliminated","","","","",null,null,null,null,null,null,null,null,null,null,null,0,0,0,0,0]
["1.6","The vendor provides evidence of strict safeguards to protect the confidentiality of personally identifiable student data, as required by ORC 3301.0714.","","","","",null,null,null,null,null,null,null,null,null,null,null,0,0,0,0,0]
[2,"VENDOR EFFECTIVENESS: Readers will evaluate vendor capacity to respond to school/district needs and support them in use of the assessment.","","","","",null,null,null,null,null,null,null,null,null,null,null,0,0,0,0,0]
[2.1,"The vendor adequately addresses its ability to develop and modify the assessment based on the unique needs of partnering schools including, but not limited to, accommodations for student disability or other student impediment to testing (such as language). Note: Assessments that screen for risk of dyslexia must include accommodations for students with the most significant cognitive disabilities. ","","","","",null,null,null,null,null,null,null,null,null,null,null,0,0,0,0,0]
{"$rows_left_out":80}
{"sheet":"Key Areas Table","index":1,"n_rows":10,"n_cols":6,"rows_kept":10,"cut":false,"hidden":false,"merged":[[1,1,1,5],[2,2,2,5],[2,1,3,1]]}
[]
[null,"Key Assessed Areas for Dyslexia Screening"]
[null,"Skill to Screen","Grade(s)"]
[null,null,"K",1,"2","3-6"]
[null,"Phonemic Awareness","X","X"]
[null,"Letter Naming","X","X"]
[null,"Letter-Sound Correspondence","X","X","X (through beginning of 2nd)"]
[null,"Real and Nonword Reading","X(end of year)","X","X (nonwords through beginning of 2nd)"]
[null,"Oral Text Reading Accuracy and Rate",null,"X (starting mid-year)","X","X"]
[null,"Comprehension",null,null,null,"x"]

{"sheet":"Requirements","index":2,"n_rows":88,"n_cols":16,"rows_kept":88,"cut":false,"hidden":true,"merged":[]}
[null,"K-3 Diagnostic","Dyslexia Tier 1 Screener","Alternative Reading","Alternative 3-8 Science","Alternative 3-8 ELA","Alternative 3-8 Math","Alternative High School","High Quality Student Data (HQSD)","Gifted: Test of Specific Academic Ability ","Gifted:  Test of Intelligence","Gifted:  Test of Creative Ability ","Gifted:  Checklist of Artistic Ability ","Gifted:  Checklist of Creative Behaviors","Gifted:  Visual or Performing Arts Rubric","None"]
[1.1000000000000001,"Required","Required","Required","Required","Required","Required","Required","Required","Required","Required","Required","Required","Required","Required",0]
[1.2,"Required","Required","Required","Required","Required","Required","Required","Required","Required","Required","Required","Required","Required","Required",0]
[1.3,"Required","Required","Required","Required","Required","Required","Required","Required","Required","Required","Required","Required","Required","Required",0]
[1.4,0,0,0,0,0,0,0,0,0,0,0,0,0,0,0]
["1.5",0,0,0,0,0,0,0,0,0,0,0,0,0,0,0]
["1.6","Required","Required","Required","Required","Required","Required","Required","Required","Required","Required","Required","Required","Required","Required",0]
[2,0,0,0,0,0,0,0,0,0,0,0,0,0,0,0]
[2.1,"Required","Required","Required","Required","Required","Required","Required","Required","Required","Required","Required","Required","Required","Required",0]
[2.2000000000000002,"Required","Required","Required","Required","Required","Required","Required","Required","Required","Required","Required","Required","Required","Required",0]
[3,0,0,0,0,0,0,0,0,0,0,0,0,0,0,0]
[3.1,"Required","Required","Required","Required","Required","Required","Required","Required","Required","Required","Required","Required","Required","Required",0]
[3.2,"Required","Required","Required","Required","Required","Required","Required","Required","Required","Required","Required","Required","Required","Required",0]
[3.3,"Required","Required","Required","Required","Required","Required","Required","Required","Required","Required","Required","Required","Required","Required",0]
[3.4,"Required","Required","Required","Required","Required","Required","Required","Required","Required","Required","Required","Required","Required","Required",0]
[3.5,"Required","Required","Required","Required","Required","Required","Required","Required","Required","Required","Required","Required","Required","Required",0]
[3.6,"Required","Required","Required","Required","Required","Required","Required","Required","Required","Required","Required","Required","Required","Required",0]
[3.7,"Required","Required","Required","as","Required","Required","Required","Required","Required","Required","Required","Required","Required","Required",0]
["3.8","Required","Required","Required","Required","Required","Required","Required","Required","Required","Required","Required","Required","Required","Required",0]
[3.9,0,0,0,0,0,0,0,0,0,0,0,0,0,0,0]
{"$rows_left_out":69}
{"sheet":"Vendor Information Sheet","index":3,"n_rows":10,"n_cols":11,"rows_kept":10,"cut":false,"hidden":true,"merged":[[2,2,2,3],[3,2,3,3],[2,4,4,10]]}
[]
[]
[null,"Vendor Name",{"$f":"VendorResponse!C3","v":0},null,"Please create a new, clearly labeled tab for any scores or charts that are required for approvals. "]
[null,"Assessment Name",{"$f":"VendorResponse!C4","v":0}]
[]
[null,null,"Desired Approval","Grade(s) or Grade Band(s)","Content Aligned","Application Sufficient","Intended for specialized populations? If yes please specify","Program Approval","Tech Approval","Specific battery, form, or index","Notes or limitations on approval"]
[null,"Application #1",{"$f":"VendorResponse!C11","v":"None"},{"$f":"VendorResponse!C7","v":0},{"$f":"VendorResponse!C8","v":0},{"$f":"VendorResponse!C9","v":"No Issue Noted"}]
[null,"Application #2",{"$f":"VendorResponse!D11","v":"None"},{"$f":"VendorResponse!D7","v":0},{"$f":"VendorResponse!D8","v":0},{"$f":"VendorResponse!D9","v":"No Issue Noted"}]
[null,"Application #3",{"$f":"VendorResponse!E11","v":"None"},{"$f":"VendorResponse!E7","v":0},{"$f":"VendorResponse!E8","v":0},{"$f":"VendorResponse!E9","v":"No Issue Noted"}]
[null,"Application #4",{"$f":"VendorResponse!F11","v":"None"},{"$f":"VendorResponse!F7","v":0},{"$f":"VendorResponse!F8","v":0},{"$f":"VendorResponse!F9","v":"No Issue Noted"}]

{"sheet":"Print Version","index":4,"n_rows":89,"n_cols":16,"rows_kept":89,"cut":false,"hidden":true,"merged":[]}
["Element","Requirement","K-3 Diagnostic","Dyslexia Tier 1 Screener","Alternative Reading","Alternative 3-8 Science","Alternative 3-8 ELA","Alternative 3-8 Math","Alternative High School","High Quality Student Data (HQSD)","Gifted: Test of Specific Academic Ability ","Gifted:  Test of Intelligence","Gifted:  Test of Creative Ability ","Gifted:  Checklist of Artistic Ability ","Gifted:  Checklist of Creative Behaviors","Gifted:  Visual or Performing Arts Rubric"]
[1,{"$f":"VendorResponse!B12","v":"VENDOR CAPABILITY: Readers will evaluate general capacity of vendor to meet assessment needs of Ohio districts."}]
[1.1000000000000001,{"$f":"VendorResponse!B13","v":"The vendor describes sufficient services to reasonably support needs of LEAs (training and professional development as needed to administer assessment and interpret results, ongoing communication and support available during test administration)."},"Required","Required","Required","Required","Required","Required","Required","Required","Required","Required","Required","Required","Required","Required"]
[1.2,{"$f":"VendorResponse!B14","v":"Organizational structure for service delivery (location, supervision, staff) is described adequately to allow LEAs to make informed decisions."},"Required","Required","Required","Required","Required","Required","Required","Required","Required","Required","Required","Required","Required","Required"]
[1.3,{"$f":"VendorResponse!B15","v":"The vendor describes a history of producing assessment instruments supported by three references for whom it has provided similar services in the past."},"Required","Required","Required","Required","Required","Required","Required","Required","Required","Required","Required","Required","Required","Required"]
[1.4,{"$f":"VendorResponse!B16","v":"Requirement Eliminated"},0,0,0,0,0,0,0,0,0,0,0,0,0,0]
["1.5",{"$f":"VendorResponse!B17","v":"Requirement Eliminated"},0,0,0,0,0,0,0,0,0,0,0,0,0,0]
["1.6",{"$f":"VendorResponse!B18","v":"The vendor provides evidence of strict safeguards to protect the confidentiality of personally identifiable student data, as required by ORC 3301.0714."},"Required","Required","Required","Required","Required","Required","Required","Required","Required","Required","Required","Required","Required","Required"]
[2,{"$f":"VendorResponse!B19","v":"VENDOR EFFECTIVENESS: Readers will evaluate vendor capacity to respond to school/district needs and support them in use of the assessment."},0,0,0,0,0,0,0,0,0,0,0,0,0,0]
[2.1,{"$f":"VendorResponse!B20","v":"The vendor adequately addresses its ability to develop and modify the assessment based on the unique needs of partnering schools including, but not limited to, accommodations for student disability or other student impediment to testing (such as language). Note: Assessments that screen for risk of dyslexia must include accommodations for students with the most significant cognitive disabilities. "},"Required","Required","Required","Required","Required","Required","Required","Required","Required","Required","Required","Required","Required","Required"]
[2.2000000000000002,{"$f":"VendorResponse!B21","v":"The vendor provides a detailed description of its ability to support districts in administering assessments as modified above."},"Required","Required","Required","Required","Required","Required","Required","Required","Required","Required","Required","Required","Required","Required"]
[3,{"$f":"VendorResponse!B22","v":"ADMINISTRATION, SCORING, AND REPORTING: Readers will consider both general indicators of adequacy and specific scoring and reporting needs for individual assessment uses."},0,0,0,0,0,0,0,0,0,0,0,0,0,0]
[3.1,{"$f":"VendorResponse!B23","v":"The vendor adequately describes the assessment administration protocol. The vendor's administration protocol must allow a test administrator unfamiliar with the particular assessment to be able to understand and administer the assessment in an appropriate and standardized manner."},"Required","Required","Required","Required","Required","Required","Required","Required","Required","Required","Required","Required","Required","Required"]
[3.2,{"$f":"VendorResponse!B24","v":"The vendor provides a description of administrator training needs and adequately describes how any necessary administrator training will be provided."},"Required","Required","Required","Required","Required","Required","Required","Required","Required","Required","Required","Required","Required","Required"]
[3.3,{"$f":"VendorResponse!B25","v":"The vendor provides information regarding the point during the instructional year at which the assessment should be administered (e.g., a certain percentage of the way through the year or after specific concepts are covered) AND this aligns with needs/expectations for the specific approval being sought."},"Required","Required","Required","Required","Required","Required","Required","Required","Required","Required","Required","Required","Required","Required"]
[3.4,{"$f":"VendorResponse!B26","v":"The vendor provides adequate information regarding the time allowed for a student to complete the assessment. If not timed, the expected time needed to complete by subgroups of students is provided."},"Required","Required","Required","Required","Required","Required","Required","Required","Required","Required","Required","Required","Required","Required"]
[3.5,{"$f":"VendorResponse!B27","v":"The vendor provides adequate documentation for use of assessment with student subgroups to allow LEAs to make informed decisions regarding suitability for their populations (e.g., suitability of the assessment for English learners; availability of assessment in non-English languages and comparability of results from non-English forms to the English version; suitability of the assessment for students with disabilities; suitability of the assessment for gifted students; and associated administration protocols)."},"Required","Required","Required","Required","Required","Required","Required","Required","Required","Required","Required","Required","Required","Required"]
[3.6,{"$f":"VendorResponse!B28","v":"The vendor commits to timely scoring and reporting. There are specific deadlines and windows associated with many assessment uses."},"Required","Required","Required","Required","Required","Required","Required","Required","Required","Required","Required","Required","Required","Required"]
[3.7,{"$f":"VendorResponse!B29","v":"The vendor adequately describes any technology requirements associated with each proposed assessment."},"Required","Required","Required","as","Required","Required","Required","Required","Required","Required","Required","Required","Required","Required"]
["3.8",{"$f":"VendorResponse!B30","v":"The vendor provides recommendations on who should score the assessment as appropriate and relevant (e.g., vendor scored, locally scored, qualifications of scorers)."},"Required","Required","Required","Required","Required","Required","Required","Required","Required","Required","Required","Required","Required","Required"]
{"$rows_left_out":70}
{"sheet":"ApprovalDetails","index":5,"n_rows":97,"n_cols":22,"rows_kept":97,"cut":false,"hidden":true,"merged":[]}
["Requirement 6.5 Classification Accuracy",null,null,null,null,null,"Requirement 7.1 Norming Data Date",null,null,"Requirement 3.12.k  Standard Error of Measure and Standard Deviations",null,null,"Requirement 6.2 Validity",null,null,null,null,"Requirements 8.1, 8.2, & 8.3 Reliability"]
["Grade Level","AUC","Sensitivity","Specificity","Meets Requirement",null,"Year of Norms",null,null,"Standard Error of Measure",null,null,"Concurrent Validity",null,"Predicitive Validity",null,null,"Grade Level or Grouping","Reliability","TRT Reliability","PreScreen","ID"]
["K",null,null,null,null,null,null,null,null,"1 Standard Deviation",null,null,"Grade Level or Group","Coefficient","Grade Level or Group","Coefficient"]
[1,null,null,null,null,null,null,null,null,"2 Standard Deviations"]
[2,null,null,null,null,null,null,null,null,"Computation Info"]
[3]
[4]
[5]
[6]
[]
[]
[]
[]
[]
[]
[]
[]
[]
[]
[]
{"$rows_left_out":78}
{"sheet":"Dyslexia Short Form","index":6,"n_rows":15,"n_cols":16,"rows_kept":15,"cut":false,"hidden":true,"merged":[[6,4,6,6],[6,7,6,10],[6,12,6,15],[1,0,2,6],[3,3,3,6],[4,3,4,6],[5,3,5,6]]}
["Short Form Vendor Submission Tool 2024-2025"]
["Vendors should use this short form only if they are seeking approval as a Tier 1 Dsylexia Screener for an assessment that is already approved as an K-3 Diagnostic Alternative. Please only use this form if nothing has been changed on the assessment. If the assessment has changed in any way you must submit an aplication for a complete review. Please submit this form as an .xlsm and as a pdf."]
[]
[null,null,"Enter Vendor Name Here:"]
[null,null,"Enter Assessment Name/Description:"]
[null,null,null,"K-3 Diagnostic and Dyslexia Tier 1 Screener"]
[null,null,null,null,"Vendor Documentation",null,null,"1st ODE Evaluation",null,null,null,null,"2nd ODE Evaluation"]
[null,"Element","Requirement",{"$f":"D6","v":"K-3 Diagnostic and Dyslexia Tier 1 Screener"},"Document File Name and Location","Page Number of Information","Additional Notes","First Score Adequate","Provided Documentation","Notes","Reader Names","Additional Vendor Response","Second Score Adequate?","Provided Documentatopm","Re-Read Notes","Re-Reader Names"]
[null,"3.12.f",{"$f":"_xlfn.XLOOKUP(B9,VendorResponse!A:A,VendorResponse!B:B,\"\",0)","v":"Provides scores to indicate risk for dyslexia in each of the assessed areas for beginning, middle and end of year, in order to guide instruction and intervention."},"Required"]
[null,"3.12.g",{"$f":"_xlfn.XLOOKUP(B10,VendorResponse!A:A,VendorResponse!B:B,\"\",0)","v":"Provides evidence of an effective methodology used to set scores indicating level of risk of dyslexia."},"Required"]
[null,"3.12.h",{"$f":"_xlfn.XLOOKUP(B11,VendorResponse!A:A,VendorResponse!B:B,\"\",0)","v":"Provides guidance to teachers in the use of scores to guide instruction."},"Required"]
[null,"4.5.i",{"$f":"_xlfn.XLOOKUP(B12,VendorResponse!A:A,VendorResponse!B:B,\"\",0)","v":"The vendor provides evidence that the instrument assesses each of the Key Assessment Areas (also listed on Table 2 of the RFQ)."},"Required"]
[null,6.3,{"$f":"_xlfn.XLOOKUP(B13,VendorResponse!A:A,VendorResponse!B:B,\"\",0)","v":"The vendor provides endorsement by professional groups, expert review, or publication in Mental Measurement Yearbook or other peer-reviewed journals as evidence of validity of instrument."},"Required"]
[null,"6.5",{"$f":"_xlfn.XLOOKUP(B14,VendorResponse!A:A,VendorResponse!B:B,\"\",0)","v":"Vendor provides evidence of sensitivity and specificity in identification of students not meeting pre-reading and reading goals that may indicate a risk of dyslexia. Vendors may demonstrate sensitivity at 80%, individual levels of specificity and sensitivity at 70%, or a combined AUC of 80%. Vendors should provide information for each grade level tested. "},"Required"]
[null,"6.6",{"$f":"_xlfn.XLOOKUP(B15,VendorResponse!A:A,VendorResponse!B:B,\"\",0)","v":"The vendor describes how the instrument provides a direct assessment of the essential early literacy skills, employing direct observation of the student by an assessor where appropriate. "},"Required"]